{"text_format":"1","workbook":"xlsx","n_sheets":7,"sheets":["Introduction and outcomes","Checklist","Dashboard","Optional - input raw data","RAG rating data for your school","RAG rating data for all schools","Calcs"],"not_rendered":{"charts":0,"images":0,"macros":1,"external_links":4,"defined_names":96,"comments":0,"pivot_tables":0},"unopened":[],"bounds":{"document_bytes":16777216,"sheet_cells":100000,"rows_first":2000,"rows_last":500,"rows_between":2000,"halvings":0,"cell_chars":16384,"cell_head_chars":4096},"cells_cut":0,"cells_raw":0,"read":"whole","date_system":"1900"}

{"sheet":"Introduction and outcomes","index":0,"n_rows":21,"n_cols":15,"rows_kept":21,"cut":false,"hidden":false,"merged":[[18,2,18,10],[18,11,18,13],[20,2,20,10],[20,11,20,13],[22,2,22,9],[12,2,12,19],[14,2,14,10],[14,11,14,13],[14,14,14,18],[16,2,16,10],[16,11,16,13],[11,2,11,19],[2,2,2,19],[4,2,4,19],[5,2,5,19],[6,2,6,19],[9,2,9,19]]}
[]
[]
[null,null,"Introduction to the schools financial value standard (SFVS)"]
[]
[null,null,"The schools financial value standard helps to provide schools with assurance that they are meeting the basic standards necessary to achieve a good level of financial health and resource management. \n\nThe tool can be used to identify possible areas for change to ensure that resources are being used to support high-quality teaching and the best education outcomes for pupils. The tool is in two parts:"]
[null,null,"1. A checklist, which asks a number of questions of governing bodies in six areas of resource management to provide assurance that the school is managing its resources effectively."]
[null,null,"2. A dashboard, which shows how a school's data compares to thresholds on a range of statistics that have been identified as indicators for good resource management and outcomes."]
[]
[]
[null,null,"Outcome of schools financial value standard (SFVS)"]
[]
[null,null,"Summary of agreed action and timetable for reporting back:"]
[null,null,"Aware we have answered NO to question Q21 as we do not look at DfE recommended deals when considering best value for non-staff expenditure. However the SBM will ensure these are checked from now on and use to compare best value against other quotes etc.                                                                                                                                          Areas highlighted red by RAG rating data on the Dashboard:  high expenditure on teaching staff and high expenditure on premises costs - these have already been noted and discussed with governors, and plans are in place for future years. Need to bring costs down in line with two bulge classes leaving over the last two academic years. "]
[]
[null,null,"Signature:",null,null,null,null,null,null,null,null,null,null,null,"Chair of governing body / management committee"]
{"$rows_left_out":7}
{"sheet":"Checklist","index":1,"n_rows":62,"n_cols":15,"rows_kept":62,"cut":false,"hidden":false,"merged":[[63,2,63,9],[8,2,9,6],[8,7,9,20],[10,2,10,6],[10,7,10,20],[56,3,56,9],[56,14,56,20],[57,3,57,9],[57,14,57,20],[59,2,59,20],[61,3,61,9],[61,14,61,20],[53,3,53,9],[53,14,53,20],[54,3,54,9],[54,14,54,20],[55,3,55,9],[55,14,55,20],[47,3,47,9],[47,14,47,20],[48,3,48,9],[48,14,48,20],[50,2,50,20],[52,3,52,9],[52,14,52,20],[44,3,44,9],[44,14,44,20],[45,3,45,9],[45,14,45,20],[46,3,46,9],[46,14,46,20],[43,3,43,9],[43,14,43,20],[32,3,32,9],[32,14,32,20],[33,3,33,9],[33,14,33,20],[35,2,35,20],[37,3,37,9],[37,14,37,20],[38,3,38,9],[38,14,38,20],[39,3,39,9],[39,14,39,20],[41,2,41,20],[31,3,31,9],[31,14,31,20],[21,2,21,20],[23,3,23,9],[23,14,23,20],[24,3,24,9],[24,14,24,20],[25,3,25,9],[25,14,25,20],[27,2,27,20],[29,3,29,9],[29,14,29,20],[30,3,30,9],[30,14,30,20],[17,3,17,9],[17,14,17,20],[18,3,18,9],[18,14,18,20],[19,3,19,9],[19,14,19,20],[13,2,13,20],[15,3,15,9],[15,14,15,20],[16,3,16,9],[16,14,16,20],[2,2,2,20],[4,2,4,20],[5,2,5,20],[6,2,6,20],[12,14,12,20]]}
[]
[]
[null,null,"Schools financial value standard - checklist"]
[]
[null,null,"The checklist asks a number of questions of governing bodies in six areas of resource management to help provide assurance that resources are being managed effectively. \n\nThe completion of this assessment forms part of the schools financial value standard. Your return must be submitted to your local authority"]
[null,null,"Guidance on completion of this document can be found here. This guidance also includes examples of good practice and details further support available to assist governing bodies in addressing specific issues. Clicking on the individual questions below will also take you to the relevant section of the guidance."]
[null,null,"Schools should answer each question with 'yes', 'no', or 'in part' from the drop down lists provided. They should provide comments, evidence and proposed actions for questions as appropriate."]
[]
[null,null,"School name:",null,null,null,null,"Furzefield Primary School"]
[]
[null,null,"School LAEstab number:",null,null,null,null,9362954]
[]
[null,null,null,null,null,null,null,null,null,null,null,null,"Answer",null,"Comments, evidence and proposed actions"]
[null,null,"A. Governance"]
[]
{"$rows_left_out":48}
{"sheet":"Dashboard","index":2,"n_rows":65,"n_cols":9,"rows_kept":65,"cut":false,"hidden":false,"merged":[[30,2,30,3],[56,2,56,3],[57,2,57,3],[58,2,58,3],[59,2,59,3],[35,2,35,3],[64,2,70,8],[14,5,14,8],[16,5,18,8],[22,2,22,3],[23,2,23,3],[41,2,41,3],[42,2,42,3],[46,2,46,3],[47,2,47,3],[48,2,48,3],[49,2,49,3],[50,2,50,3],[51,2,51,3],[52,2,52,3],[29,2,29,3],[54,2,54,4],[62,2,62,4],[25,6,26,6],[25,8,26,8],[4,2,4,8],[12,2,12,4],[21,2,21,4],[36,2,36,3],[37,2,37,3],[27,2,27,4],[39,2,39,4],[44,2,44,4],[31,2,31,3],[32,2,32,3],[33,2,33,3],[34,2,34,3],[60,2,60,3],[2,2,2,8],[6,2,6,8],[7,2,7,8],[8,2,8,8],[10,2,10,8]]}
[]
[]
[null,null,"Schools financial value standard - dashboard"]
[]
[null,null,"Effective resource management is about how a school uses its resources to drive outcomes for its pupils. A school can improve outcomes by using its resources more effectively.\n \nThe dashboard below is designed to help schools identify areas for improved resource management. It shows how a school compares to thresholds on a range of key indicators. \n\nThe completion of this assessment forms part of the annual schools financial value standard."]
[]
[null,null,"\nUsing the dashboard\n\nSchools should use the most up to date data available to them, and not rely on lagged published data.\n \nComplete all highlighted cells."]
[null,null,"Guidance on calculating or collecting the data for the school so that metrics are compared to thresholds consistently can be found here. Clicking on the link next to individual indicators below will also take you to the relevant section of the guidance."]
[null,null,"Either input the school's percentages and ratios directly, or complete the Optional - input raw data form with spending information and school characteristics. The percentages and ratios in the dashboard will then auto-calculate."]
[]
[null,null,"Using the results from the dashboard\n\nClick here for explanations of what the red, amber and green (RAG) ratings mean and what do with the results."]
[]
[null,null,"A. Information about your school"]
["*",null,null,null,null,null,1]
[null,null,"School name:","Furzefield Primary School",null,"Click here to see the RAG rating data for this school"]
{"$rows_left_out":51}
{"sheet":"Optional - input raw data","index":3,"n_rows":55,"n_cols":6,"rows_kept":55,"cut":false,"hidden":false,"merged":[[2,2,2,3],[4,2,4,5],[5,2,5,5],[21,2,21,3],[18,2,18,3],[17,2,17,3],[14,2,14,3],[13,2,13,3],[20,2,20,3],[16,2,16,3],[12,2,12,3],[10,2,10,3],[8,2,8,3],[9,2,9,3]]}
[]
[]
[null,null,"Raw data form"]
[null,null,null,null,null,1]
[null,null,"This form can be used to input raw spend and characteristics information. If used, the information in this table will be used to calculate the percentages and ratios required in the dashboard. Alternatively, \nclick here to input the percentages and ratios directly into the dashboard."]
[null,null,"Schools should use the most up to date information available to them, and not rely on lagged published data.\n\nAll of the data should refer to the same financial year."]
[]
[]
[null,null,"Full time equivalent number of teachers (classroom and leadership)",null,null,25.17]
[null,null,"Full time equivalent of teachers in the leadership group",null,null,3]
[null,null,"Full time equivalent of total school workforce",null,null,64.540000000000006]
[]
[null,null,"Total expenditure",null,null,2772002]
[null,null,"Total income",null,null,2564277]
[null,null,"Revenue balances (committed and uncommitted)",null,null,145491]
{"$rows_left_out":41}
{"sheet":"RAG rating data for your school","index":4,"n_rows":94,"n_cols":20,"rows_kept":94,"cut":false,"hidden":false,"merged":[[1,7,9,19],[84,1,85,1],[87,1,88,1],[90,1,91,1],[93,1,94,1],[70,1,71,1],[73,1,74,1],[81,1,82,1],[79,3,79,4],[79,6,79,9],[79,11,79,14],[79,16,79,19],[55,1,56,1],[58,1,59,1],[61,1,62,1],[67,1,68,1],[64,1,65,1],[42,16,42,19],[44,1,45,1],[47,1,48,1],[53,3,53,4],[53,6,53,9],[53,11,53,14],[53,16,53,19],[33,1,34,1],[36,1,37,1],[42,3,42,4],[42,6,42,9],[42,11,42,14],[24,1,25,1],[27,1,28,1],[15,1,16,1],[13,3,13,4],[30,1,31,1],[13,6,13,9],[13,11,13,14],[13,16,13,19],[18,1,19,1],[21,1,22,1]]}
[]
[null,"Your school has been identified as:",null,null,null,null,null,"The RAG ratings have been calculated using maintained school and academy 2017 to 18 data.\n\nThe majority of metrics in the dashboard are percentages and ratios which at a national level don't change significantly year on year, so they still provide a fair and useful comparison with your up to date data.\n\nThe exception is average teacher cost, which does change year on year. To reflect the latest pay awards (from September 2018 and September 2019) and pensions contribution changes we have uplifted the underlying data by 11.2%. The thresholds therefore reflect average teacher costs for the academic year 2019/20."]
[null,{"$f":"IF(Dashboard!D15=\"\",\"\",\"- \"&\nINDEX(Calcs!L:L,MATCH(Dashboard!D15,Calcs!A:A,0)))","v":"- a primary school"}]
[null,{"$f":"IF(Dashboard!D15=\"\",\"\",\"- \"&\nINDEX(Calcs!I:I,MATCH(Dashboard!D15,Calcs!A:A,0)))","v":"- outside London"}]
[null,{"$f":"IF(Dashboard!D15=\"\",\"\",\nIF(OR($B$3=\"- an alternative provision school\",$B$3=\"- a special school\",$B$3=\"- an all-through school\",$B$3=\"- a nursery school\"),\"\",\n\"- a \"&INDEX(Calcs!J:J,MATCH(Dashboard!D15,Calcs!A:A,0))&\" school because it has \"&INDEX(Calcs!M:M,MATCH(Dashboard!D15,Calcs!A:A,0))))","v":"- a large school because it has more than 385 pupils"}]
[null,{"$f":"IF(Dashboard!D15=\"\",\"\",\nIF(OR($B$3=\"- an alternative provision school\",$B$3=\"- a special school\",$B$3=\"- an all-through school\",$B$3=\"- a nursery school\"),\"\",\n\"- a school with \"&INDEX(Calcs!K:K,MATCH(Dashboard!D15,Calcs!A:A,0))&\" because \"&INDEX(Calcs!N:N,MATCH(Dashboard!D15,Calcs!A:A,0))&\" are eligible\"))","v":"- a school with high levels of FSM because more than 18% of pupils are eligible"}]
[]
[]
[]
[null,"The thresholds for the RAG ratings are based on these characteristics and are:"]
[]
[null,"B. Your spending as a percentage of expenditure"]
[]
[null,null,null,"Red rating",null,null,"Amber rating",null,null,null,null,"Light green rating",null,null,null,null,"Dark green rating"]
[]
{"$rows_left_out":80}
{"sheet":"RAG rating data for all schools","index":5,"n_rows":559,"n_cols":14,"rows_kept":559,"cut":false,"hidden":false,"merged":[[426,3,426,4],[541,3,541,4]]}
[null,"Expand the groups to see the thresholds"]
[]
["Sample size","Phase","Size","FSM",null,"Red if less than:","Amber if less than:","Dark green if between:","(Median)","and:","Amber if more than:","Red if more than:",null,"Light green for everything else"]
[726,"Primary","Very small","Low FSM","PVSL"]
[null,"Primary","Very small","Low FSM","Spend on teaching staff as a percentage of total expenditure",0.39500000000000002,0.42,0.45500000000000002,0.47,0.48499999999999999,0.51500000000000001,0.54]
[null,"Primary","Very small","Low FSM","Spend on supply staff as a percentage of total expenditure",null,null,0.02,0.02,2.5000000000000001E-2,0.04,5.5E-2]
[null,"Primary","Very small","Low FSM","Spend on education support staff as a percentage of total expenditure",null,null,0.125,0.13,0.14499999999999999,0.17,0.19]
[null,"Primary","Very small","Low FSM","Spend on administrative and clerical staff as a percentage of total expenditure",null,null,null,5.5E-2,null,7.4999999999999997E-2,8.5000000000000006E-2]
[null,"Primary","Very small","Low FSM","Spend on other staff costs as a percentage of total expenditure",null,null,null,0.03,null,0.05,0.06]
[null,"Primary","Very small","Low FSM","Spend on premises (including staff costs) as a percentage of total expenditure",null,null,null,0.05,null,6.5000000000000002E-2,0.08]
[null,"Primary","Very small","Low FSM","Spend on teaching resources as a percentage of total expenditure",0.03,0.04,0.05,5.5E-2,6.5000000000000002E-2]
[null,"Primary","Very small","Low FSM","Spend on energy as a percentage of total expenditure",null,null,null,0.01,null,1.4999999999999999E-2,0.02]
[null,"Primary","Very small","Low FSM","Senior leaders as a percentage of workforce",null,null,0.115,0.125,0.14000000000000001,0.17499999999999999,0.21]
[null,"Primary","Very small","Low FSM","Pupil to teacher ratio",12,14,16,17,18,20,22.5]
[null,"Primary","Very small","Low FSM","Pupil to adult ratio",6,7,8,8.5,9,10,11]
{"$rows_left_out":545}
{"sheet":"Calcs","index":6,"n_rows":66,"n_cols":27,"rows_kept":66,"cut":false,"hidden":true,"merged":[]}
[]
["RAG ratings for each school"]
[]
[null,null,1]
[null,null,{"$f":"IF(Dashboard!D17=\"Primary\",\"P\",IF(Dashboard!D17=\"Secondary with sixth form\",\"SS\",IF(Dashboard!D17=\"Secondary without sixth form\",\"S\",IF(Dashboard!D17=\"Special\",\"SP\",IF(Dashboard!D17=\"Alternative provision\",\"AP\",IF(Dashboard!D17=\"All-through\",\"AT\",IF(Dashboard!D17=\"Nursery\",\"N\")))))))","v":"P"}]
[null,null,{"$f":"C5&\nIF($J29=\"very small\",\"VS\",IF($J29=\"small\",\"S\",IF($J29=\"medium\",\"M\",IF($J29=\"large\",\"L\"))))&\nIF($K29=\"low levels of FSM\",\"L\",IF($K29=\"medium levels of FSM\",\"M\",IF($K29=\"high levels of FSM\",\"H\")))","v":"PLH"}]
[null,null,{"$f":"C5&\nIF(AND(C5=\"SS\",$I29=\"in London\"),\"Lo\",IF($I29=\"in London\",\"L\",IF($I29=\"outside London\",\"NL\")))","v":"PNL"}]
[null,null,1,2,3,4,5,6,7]
["Spend on teaching staff as a percentage of total expenditure",1,{"$f":"IF(OR($C$5=\"P\",$C$5=\"SS\",$C$5=\"S\"),INDEX(INDIRECT($C$6),$B9,C$8),\nIF(OR($C$5=\"N\",$C$5=\"AP\",$C$5=\"AT\",$C$5=\"SP\"),INDEX(INDIRECT($C$7),$B9,C$8)))","v":0.35499999999999998},0.38,0.41,0.42499999999999999,0.435,0.46500000000000002,0.49]
["Spend on supply staff as a percentage of total expenditure",2,null,null,{"$f":"IF(OR($C$5=\"P\",$C$5=\"SS\",$C$5=\"S\"),INDEX(INDIRECT($C$6),$B10,E$8),\nIF(OR($C$5=\"N\",$C$5=\"AP\",$C$5=\"AT\",$C$5=\"SP\"),INDEX(INDIRECT($C$7),$B10,E$8)))","v":0.02},2.5000000000000001E-2,0.03,4.4999999999999998E-2,0.06]
["Spend on education support staff as a percentage of total expenditure",3,null,null,0.19500000000000001,0.20499999999999999,0.22,0.25,0.26500000000000001]
["Spend on administrative and clerical staff as a percentage of total expenditure",4,null,null,null,{"$f":"IF(OR($C$5=\"P\",$C$5=\"SS\",$C$5=\"S\"),INDEX(INDIRECT($C$6),$B12,F$8),\nIF(OR($C$5=\"N\",$C$5=\"AP\",$C$5=\"AT\",$C$5=\"SP\"),INDEX(INDIRECT($C$7),$B12,F$8)))","v":4.4999999999999998E-2},null,{"$f":"IF(OR($C$5=\"P\",$C$5=\"SS\",$C$5=\"S\"),INDEX(INDIRECT($C$6),$B12,H$8),\nIF(OR($C$5=\"N\",$C$5=\"AP\",$C$5=\"AT\",$C$5=\"SP\"),INDEX(INDIRECT($C$7),$B12,H$8)))","v":0.06},{"$f":"IF(OR($C$5=\"P\",$C$5=\"SS\",$C$5=\"S\"),INDEX(INDIRECT($C$6),$B12,I$8),\nIF(OR($C$5=\"N\",$C$5=\"AP\",$C$5=\"AT\",$C$5=\"SP\"),INDEX(INDIRECT($C$7),$B12,I$8)))","v":7.4999999999999997E-2}]
["Spend on other staff costs as a percentage of total expenditure",5,null,null,null,3.5000000000000003E-2,null,{"$f":"IF(OR($C$5=\"P\",$C$5=\"SS\",$C$5=\"S\"),INDEX(INDIRECT($C$6),$B13,H$8),\nIF(OR($C$5=\"N\",$C$5=\"AP\",$C$5=\"AT\",$C$5=\"SP\"),INDEX(INDIRECT($C$7),$B13,H$8)))","v":4.4999999999999998E-2},{"$f":"IF(OR($C$5=\"P\",$C$5=\"SS\",$C$5=\"S\"),INDEX(INDIRECT($C$6),$B13,I$8),\nIF(OR($C$5=\"N\",$C$5=\"AP\",$C$5=\"AT\",$C$5=\"SP\"),INDEX(INDIRECT($C$7),$B13,I$8)))","v":0.06}]
["Spend on premises (including staff costs) as a percentage of total expenditure",6,null,null,null,0.05,null,{"$f":"IF(OR($C$5=\"P\",$C$5=\"SS\",$C$5=\"S\"),INDEX(INDIRECT($C$6),$B14,H$8),\nIF(OR($C$5=\"N\",$C$5=\"AP\",$C$5=\"AT\",$C$5=\"SP\"),INDEX(INDIRECT($C$7),$B14,H$8)))","v":7.0000000000000007E-2},0.08]
["Spend on teaching resources as a percentage of total expenditure",7,{"$f":"IF(OR($C$5=\"P\",$C$5=\"SS\",$C$5=\"S\"),INDEX(INDIRECT($C$6),$B15,C$8),\nIF(OR($C$5=\"N\",$C$5=\"AP\",$C$5=\"AT\",$C$5=\"SP\"),INDEX(INDIRECT($C$7),$B15,C$8)))","v":2.5000000000000001E-2},{"$f":"IF(OR($C$5=\"P\",$C$5=\"SS\",$C$5=\"S\"),INDEX(INDIRECT($C$6),$B15,D$8),\nIF(OR($C$5=\"N\",$C$5=\"AP\",$C$5=\"AT\",$C$5=\"SP\"),INDEX(INDIRECT($C$7),$B15,D$8)))","v":0.03},{"$f":"IF(OR($C$5=\"P\",$C$5=\"SS\",$C$5=\"S\"),INDEX(INDIRECT($C$6),$B15,E$8),\nIF(OR($C$5=\"N\",$C$5=\"AP\",$C$5=\"AT\",$C$5=\"SP\"),INDEX(INDIRECT($C$7),$B15,E$8)))","v":0.04},{"$f":"IF(OR($C$5=\"P\",$C$5=\"SS\",$C$5=\"S\"),INDEX(INDIRECT($C$6),$B15,F$8),\nIF(OR($C$5=\"N\",$C$5=\"AP\",$C$5=\"AT\",$C$5=\"SP\"),INDEX(INDIRECT($C$7),$B15,F$8)))","v":4.4999999999999998E-2},{"$f":"IF(OR($C$5=\"P\",$C$5=\"SS\",$C$5=\"S\"),INDEX(INDIRECT($C$6),$B15,G$8),\nIF(OR($C$5=\"N\",$C$5=\"AP\",$C$5=\"AT\",$C$5=\"SP\"),INDEX(INDIRECT($C$7),$B15,G$8)))","v":0.05}]
{"$rows_left_out":51}